{"text_format":"1","workbook":"xlsx","n_sheets":2,"sheets":["Anmälningar_ID","Viktklasser"],"not_rendered":{"charts":0,"images":0,"macros":1,"external_links":0,"defined_names":9,"comments":0,"pivot_tables":0},"unopened":[],"bounds":{"document_bytes":16777216,"sheet_cells":100000,"rows_first":2000,"rows_last":500,"rows_between":2000,"halvings":0,"cell_chars":16384,"cell_head_chars":4096},"cells_cut":0,"cells_raw":0,"read":"whole","date_system":"1900"}

{"sheet":"Anmälningar_ID","index":0,"n_rows":501,"n_cols":13,"rows_kept":501,"cut":false,"hidden":false,"merged":[]}
["ID","Namn","Klubb","Kategori","Vikt","Anmäld",null,"Kategori","Antal ",null,null,"Tävling","Knattekampen 2019"]
[1001,"Wilma Persson","Brottning BK","WW9",29,{"$f":"IF(B2=\"\",\"\",IF(ISNA(VLOOKUP(D2,Viktklasser!$G$1:$G$28,1,FALSE)),\"fel kategori\",IF(ISNA(VLOOKUP(D2&\"_\"&E2,Viktklasser!B:D,3,FALSE)),IF(AND(D2=\"Mkn\",E2<>\"\"),D2&\" \"&E2,\"fel vikt\"),VLOOKUP(D2&\"_\"&E2,Viktklasser!B:D,3,FALSE))))","v":"WW9 29 kg"},null,"WW9",{"$f":"COUNTIF(D:D,H2)","v":1},null,null,"Datum","2019-12-14"]
[1002,"Paulinn Backman","Brottning BK","WW11",42,{"$f":"IF(B3=\"\",\"\",IF(ISNA(VLOOKUP(D3,Viktklasser!$G$1:$G$28,1,FALSE)),\"fel kategori\",IF(ISNA(VLOOKUP(D3&\"_\"&E3,Viktklasser!B:D,3,FALSE)),IF(AND(D3=\"Mkn\",E3<>\"\"),D3&\" \"&E3,\"fel vikt\"),VLOOKUP(D3&\"_\"&E3,Viktklasser!B:D,3,FALSE))))","v":"WW11 42 kg"},null,"WW11",1,null,null,"Tävlingsledare"]
[1003,"Malte Scheele","Brottning BK","L",null,{"$f":"IF(B4=\"\",\"\",IF(ISNA(VLOOKUP(D4,Viktklasser!$G$1:$G$28,1,FALSE)),\"fel kategori\",IF(ISNA(VLOOKUP(D4&\"_\"&E4,Viktklasser!B:D,3,FALSE)),IF(AND(D4=\"Mkn\",E4<>\"\"),D4&\" \"&E4,\"fel vikt\"),VLOOKUP(D4&\"_\"&E4,Viktklasser!B:D,3,FALSE))))","v":"fel kategori"},null,"WW14",0,null,null,"Telefonnummer"]
[1004,null,null,null,null,{"$f":"IF(B5=\"\",\"\",IF(ISNA(VLOOKUP(D5,Viktklasser!$G$1:$G$28,1,FALSE)),\"fel kategori\",IF(ISNA(VLOOKUP(D5&\"_\"&E5,Viktklasser!B:D,3,FALSE)),IF(AND(D5=\"Mkn\",E5<>\"\"),D5&\" \"&E5,\"fel vikt\"),VLOOKUP(D5&\"_\"&E5,Viktklasser!B:D,3,FALSE))))","v":""},null,"WW17",0,null,null,"Anmälningsavgift",150]
[1005,null,null,null,null,{"$f":"IF(B6=\"\",\"\",IF(ISNA(VLOOKUP(D6,Viktklasser!$G$1:$G$28,1,FALSE)),\"fel kategori\",IF(ISNA(VLOOKUP(D6&\"_\"&E6,Viktklasser!B:D,3,FALSE)),IF(AND(D6=\"Mkn\",E6<>\"\"),D6&\" \"&E6,\"fel vikt\"),VLOOKUP(D6&\"_\"&E6,Viktklasser!B:D,3,FALSE))))","v":""},null,"WW20",0]
[1006,null,null,null,null,{"$f":"IF(B7=\"\",\"\",IF(ISNA(VLOOKUP(D7,Viktklasser!$G$1:$G$28,1,FALSE)),\"fel kategori\",IF(ISNA(VLOOKUP(D7&\"_\"&E7,Viktklasser!B:D,3,FALSE)),IF(AND(D7=\"Mkn\",E7<>\"\"),D7&\" \"&E7,\"fel vikt\"),VLOOKUP(D7&\"_\"&E7,Viktklasser!B:D,3,FALSE))))","v":""},null,"WW23",0]
[1007,null,null,null,null,{"$f":"IF(B8=\"\",\"\",IF(ISNA(VLOOKUP(D8,Viktklasser!$G$1:$G$28,1,FALSE)),\"fel kategori\",IF(ISNA(VLOOKUP(D8&\"_\"&E8,Viktklasser!B:D,3,FALSE)),IF(AND(D8=\"Mkn\",E8<>\"\"),D8&\" \"&E8,\"fel vikt\"),VLOOKUP(D8&\"_\"&E8,Viktklasser!B:D,3,FALSE))))","v":""},null,null,null,null,null,"Kontaktuppgifter till ledare"]
[1008,null,null,null,null,{"$f":"IF(B9=\"\",\"\",IF(ISNA(VLOOKUP(D9,Viktklasser!$G$1:$G$28,1,FALSE)),\"fel kategori\",IF(ISNA(VLOOKUP(D9&\"_\"&E9,Viktklasser!B:D,3,FALSE)),IF(AND(D9=\"Mkn\",E9<>\"\"),D9&\" \"&E9,\"fel vikt\"),VLOOKUP(D9&\"_\"&E9,Viktklasser!B:D,3,FALSE))))","v":""},null,null,null,null,null,"Ledare"]
[1009,null,null,null,null,{"$f":"IF(B10=\"\",\"\",IF(ISNA(VLOOKUP(D10,Viktklasser!$G$1:$G$28,1,FALSE)),\"fel kategori\",IF(ISNA(VLOOKUP(D10&\"_\"&E10,Viktklasser!B:D,3,FALSE)),IF(AND(D10=\"Mkn\",E10<>\"\"),D10&\" \"&E10,\"fel vikt\"),VLOOKUP(D10&\"_\"&E10,Viktklasser!B:D,3,FALSE))))","v":""},null,null,null,null,null,"Klubb"]
[1010,null,null,null,null,{"$f":"IF(B11=\"\",\"\",IF(ISNA(VLOOKUP(D11,Viktklasser!$G$1:$G$28,1,FALSE)),\"fel kategori\",IF(ISNA(VLOOKUP(D11&\"_\"&E11,Viktklasser!B:D,3,FALSE)),IF(AND(D11=\"Mkn\",E11<>\"\"),D11&\" \"&E11,\"fel vikt\"),VLOOKUP(D11&\"_\"&E11,Viktklasser!B:D,3,FALSE))))","v":""},null,null,null,null,null,"Telefonnummer"]
[1011,null,null,null,null,{"$f":"IF(B12=\"\",\"\",IF(ISNA(VLOOKUP(D12,Viktklasser!$G$1:$G$28,1,FALSE)),\"fel kategori\",IF(ISNA(VLOOKUP(D12&\"_\"&E12,Viktklasser!B:D,3,FALSE)),IF(AND(D12=\"Mkn\",E12<>\"\"),D12&\" \"&E12,\"fel vikt\"),VLOOKUP(D12&\"_\"&E12,Viktklasser!B:D,3,FALSE))))","v":""}]
[1012,null,null,null,null,{"$f":"IF(B13=\"\",\"\",IF(ISNA(VLOOKUP(D13,Viktklasser!$G$1:$G$28,1,FALSE)),\"fel kategori\",IF(ISNA(VLOOKUP(D13&\"_\"&E13,Viktklasser!B:D,3,FALSE)),IF(AND(D13=\"Mkn\",E13<>\"\"),D13&\" \"&E13,\"fel vikt\"),VLOOKUP(D13&\"_\"&E13,Viktklasser!B:D,3,FALSE))))","v":""},null,null,null,null,null,"Kvittounderlag"]
[1013,null,null,null,null,{"$f":"IF(B14=\"\",\"\",IF(ISNA(VLOOKUP(D14,Viktklasser!$G$1:$G$28,1,FALSE)),\"fel kategori\",IF(ISNA(VLOOKUP(D14&\"_\"&E14,Viktklasser!B:D,3,FALSE)),IF(AND(D14=\"Mkn\",E14<>\"\"),D14&\" \"&E14,\"fel vikt\"),VLOOKUP(D14&\"_\"&E14,Viktklasser!B:D,3,FALSE))))","v":""}]
[1014,null,null,null,null,{"$f":"IF(B15=\"\",\"\",IF(ISNA(VLOOKUP(D15,Viktklasser!$G$1:$G$28,1,FALSE)),\"fel kategori\",IF(ISNA(VLOOKUP(D15&\"_\"&E15,Viktklasser!B:D,3,FALSE)),IF(AND(D15=\"Mkn\",E15<>\"\"),D15&\" \"&E15,\"fel vikt\"),VLOOKUP(D15&\"_\"&E15,Viktklasser!B:D,3,FALSE))))","v":""},null,null,null,null,null,"Anmälningsavgift ",{"$f":"SUM(I2:I28)*M5","v":300}]
[1015,null,null,null,null,{"$f":"IF(B16=\"\",\"\",IF(ISNA(VLOOKUP(D16,Viktklasser!$G$1:$G$28,1,FALSE)),\"fel kategori\",IF(ISNA(VLOOKUP(D16&\"_\"&E16,Viktklasser!B:D,3,FALSE)),IF(AND(D16=\"Mkn\",E16<>\"\"),D16&\" \"&E16,\"fel vikt\"),VLOOKUP(D16&\"_\"&E16,Viktklasser!B:D,3,FALSE))))","v":""}]
[1016,null,null,null,null,{"$f":"IF(B17=\"\",\"\",IF(ISNA(VLOOKUP(D17,Viktklasser!$G$1:$G$28,1,FALSE)),\"fel kategori\",IF(ISNA(VLOOKUP(D17&\"_\"&E17,Viktklasser!B:D,3,FALSE)),IF(AND(D17=\"Mkn\",E17<>\"\"),D17&\" \"&E17,\"fel vikt\"),VLOOKUP(D17&\"_\"&E17,Viktklasser!B:D,3,FALSE))))","v":""},null,null,null,null,null,"Totalt",{"$f":"SUM(M15:M16)","v":300}]
[1017,null,null,null,null,{"$f":"IF(B18=\"\",\"\",IF(ISNA(VLOOKUP(D18,Viktklasser!$G$1:$G$28,1,FALSE)),\"fel kategori\",IF(ISNA(VLOOKUP(D18&\"_\"&E18,Viktklasser!B:D,3,FALSE)),IF(AND(D18=\"Mkn\",E18<>\"\"),D18&\" \"&E18,\"fel vikt\"),VLOOKUP(D18&\"_\"&E18,Viktklasser!B:D,3,FALSE))))","v":""}]
[1018,null,null,null,null,{"$f":"IF(B19=\"\",\"\",IF(ISNA(VLOOKUP(D19,Viktklasser!$G$1:$G$28,1,FALSE)),\"fel kategori\",IF(ISNA(VLOOKUP(D19&\"_\"&E19,Viktklasser!B:D,3,FALSE)),IF(AND(D19=\"Mkn\",E19<>\"\"),D19&\" \"&E19,\"fel vikt\"),VLOOKUP(D19&\"_\"&E19,Viktklasser!B:D,3,FALSE))))","v":""}]
[1019,null,null,null,null,{"$f":"IF(B20=\"\",\"\",IF(ISNA(VLOOKUP(D20,Viktklasser!$G$1:$G$28,1,FALSE)),\"fel kategori\",IF(ISNA(VLOOKUP(D20&\"_\"&E20,Viktklasser!B:D,3,FALSE)),IF(AND(D20=\"Mkn\",E20<>\"\"),D20&\" \"&E20,\"fel vikt\"),VLOOKUP(D20&\"_\"&E20,Viktklasser!B:D,3,FALSE))))","v":""}]
[1020,null,null,null,null,{"$f":"IF(B21=\"\",\"\",IF(ISNA(VLOOKUP(D21,Viktklasser!$G$1:$G$28,1,FALSE)),\"fel kategori\",IF(ISNA(VLOOKUP(D21&\"_\"&E21,Viktklasser!B:D,3,FALSE)),IF(AND(D21=\"Mkn\",E21<>\"\"),D21&\" \"&E21,\"fel vikt\"),VLOOKUP(D21&\"_\"&E21,Viktklasser!B:D,3,FALSE))))","v":""}]
[1021,null,null,null,null,{"$f":"IF(B22=\"\",\"\",IF(ISNA(VLOOKUP(D22,Viktklasser!$G$1:$G$28,1,FALSE)),\"fel kategori\",IF(ISNA(VLOOKUP(D22&\"_\"&E22,Viktklasser!B:D,3,FALSE)),IF(AND(D22=\"Mkn\",E22<>\"\"),D22&\" \"&E22,\"fel vikt\"),VLOOKUP(D22&\"_\"&E22,Viktklasser!B:D,3,FALSE))))","v":""}]
[1022,null,null,null,null,{"$f":"IF(B23=\"\",\"\",IF(ISNA(VLOOKUP(D23,Viktklasser!$G$1:$G$28,1,FALSE)),\"fel kategori\",IF(ISNA(VLOOKUP(D23&\"_\"&E23,Viktklasser!B:D,3,FALSE)),IF(AND(D23=\"Mkn\",E23<>\"\"),D23&\" \"&E23,\"fel vikt\"),VLOOKUP(D23&\"_\"&E23,Viktklasser!B:D,3,FALSE))))","v":""}]
[1023,null,null,null,null,{"$f":"IF(B24=\"\",\"\",IF(ISNA(VLOOKUP(D24,Viktklasser!$G$1:$G$28,1,FALSE)),\"fel kategori\",IF(ISNA(VLOOKUP(D24&\"_\"&E24,Viktklasser!B:D,3,FALSE)),IF(AND(D24=\"Mkn\",E24<>\"\"),D24&\" \"&E24,\"fel vikt\"),VLOOKUP(D24&\"_\"&E24,Viktklasser!B:D,3,FALSE))))","v":""}]
[1024,null,null,null,null,{"$f":"IF(B25=\"\",\"\",IF(ISNA(VLOOKUP(D25,Viktklasser!$G$1:$G$28,1,FALSE)),\"fel kategori\",IF(ISNA(VLOOKUP(D25&\"_\"&E25,Viktklasser!B:D,3,FALSE)),IF(AND(D25=\"Mkn\",E25<>\"\"),D25&\" \"&E25,\"fel vikt\"),VLOOKUP(D25&\"_\"&E25,Viktklasser!B:D,3,FALSE))))","v":""}]
[1025,null,null,null,null,{"$f":"IF(B26=\"\",\"\",IF(ISNA(VLOOKUP(D26,Viktklasser!$G$1:$G$28,1,FALSE)),\"fel kategori\",IF(ISNA(VLOOKUP(D26&\"_\"&E26,Viktklasser!B:D,3,FALSE)),IF(AND(D26=\"Mkn\",E26<>\"\"),D26&\" \"&E26,\"fel vikt\"),VLOOKUP(D26&\"_\"&E26,Viktklasser!B:D,3,FALSE))))","v":""}]
[1026,null,null,null,null,{"$f":"IF(B27=\"\",\"\",IF(ISNA(VLOOKUP(D27,Viktklasser!$G$1:$G$28,1,FALSE)),\"fel kategori\",IF(ISNA(VLOOKUP(D27&\"_\"&E27,Viktklasser!B:D,3,FALSE)),IF(AND(D27=\"Mkn\",E27<>\"\"),D27&\" \"&E27,\"fel vikt\"),VLOOKUP(D27&\"_\"&E27,Viktklasser!B:D,3,FALSE))))","v":""}]
[1027,null,null,null,null,{"$f":"IF(B28=\"\",\"\",IF(ISNA(VLOOKUP(D28,Viktklasser!$G$1:$G$28,1,FALSE)),\"fel kategori\",IF(ISNA(VLOOKUP(D28&\"_\"&E28,Viktklasser!B:D,3,FALSE)),IF(AND(D28=\"Mkn\",E28<>\"\"),D28&\" \"&E28,\"fel vikt\"),VLOOKUP(D28&\"_\"&E28,Viktklasser!B:D,3,FALSE))))","v":""}]
[1028,null,null,null,null,{"$f":"IF(B29=\"\",\"\",IF(ISNA(VLOOKUP(D29,Viktklasser!$G$1:$G$28,1,FALSE)),\"fel kategori\",IF(ISNA(VLOOKUP(D29&\"_\"&E29,Viktklasser!B:D,3,FALSE)),IF(AND(D29=\"Mkn\",E29<>\"\"),D29&\" \"&E29,\"fel vikt\"),VLOOKUP(D29&\"_\"&E29,Viktklasser!B:D,3,FALSE))))","v":""},null,"L",{"$f":"COUNTIF(D:D,H29)","v":1}]
[1029,null,null,null,null,{"$f":"IF(B30=\"\",\"\",IF(ISNA(VLOOKUP(D30,Viktklasser!$G$1:$G$28,1,FALSE)),\"fel kategori\",IF(ISNA(VLOOKUP(D30&\"_\"&E30,Viktklasser!B:D,3,FALSE)),IF(AND(D30=\"Mkn\",E30<>\"\"),D30&\" \"&E30,\"fel vikt\"),VLOOKUP(D30&\"_\"&E30,Viktklasser!B:D,3,FALSE))))","v":""},null,"Totalt",{"$f":"SUM(I2:I29)","v":3}]
[1030,null,null,null,null,{"$f":"IF(B31=\"\",\"\",IF(ISNA(VLOOKUP(D31,Viktklasser!$G$1:$G$28,1,FALSE)),\"fel kategori\",IF(ISNA(VLOOKUP(D31&\"_\"&E31,Viktklasser!B:D,3,FALSE)),IF(AND(D31=\"Mkn\",E31<>\"\"),D31&\" \"&E31,\"fel vikt\"),VLOOKUP(D31&\"_\"&E31,Viktklasser!B:D,3,FALSE))))","v":""}]
[1031,null,null,null,null,{"$f":"IF(B32=\"\",\"\",IF(ISNA(VLOOKUP(D32,Viktklasser!$G$1:$G$28,1,FALSE)),\"fel kategori\",IF(ISNA(VLOOKUP(D32&\"_\"&E32,Viktklasser!B:D,3,FALSE)),IF(AND(D32=\"Mkn\",E32<>\"\"),D32&\" \"&E32,\"fel vikt\"),VLOOKUP(D32&\"_\"&E32,Viktklasser!B:D,3,FALSE))))","v":""}]
[1032,null,null,null,null,{"$f":"IF(B33=\"\",\"\",IF(ISNA(VLOOKUP(D33,Viktklasser!$G$1:$G$28,1,FALSE)),\"fel kategori\",IF(ISNA(VLOOKUP(D33&\"_\"&E33,Viktklasser!B:D,3,FALSE)),IF(AND(D33=\"Mkn\",E33<>\"\"),D33&\" \"&E33,\"fel vikt\"),VLOOKUP(D33&\"_\"&E33,Viktklasser!B:D,3,FALSE))))","v":""}]
[1033,null,null,null,null,{"$f":"IF(B34=\"\",\"\",IF(ISNA(VLOOKUP(D34,Viktklasser!$G$1:$G$28,1,FALSE)),\"fel kategori\",IF(ISNA(VLOOKUP(D34&\"_\"&E34,Viktklasser!B:D,3,FALSE)),IF(AND(D34=\"Mkn\",E34<>\"\"),D34&\" \"&E34,\"fel vikt\"),VLOOKUP(D34&\"_\"&E34,Viktklasser!B:D,3,FALSE))))","v":""}]
[1034,null,null,null,null,{"$f":"IF(B35=\"\",\"\",IF(ISNA(VLOOKUP(D35,Viktklasser!$G$1:$G$28,1,FALSE)),\"fel kategori\",IF(ISNA(VLOOKUP(D35&\"_\"&E35,Viktklasser!B:D,3,FALSE)),IF(AND(D35=\"Mkn\",E35<>\"\"),D35&\" \"&E35,\"fel vikt\"),VLOOKUP(D35&\"_\"&E35,Viktklasser!B:D,3,FALSE))))","v":""}]
[1035,null,{"$f":"IF(B36=\"\",\"\",$M$10)","v":""},null,null,{"$f":"IF(B36=\"\",\"\",IF(ISNA(VLOOKUP(D36,Viktklasser!$G$1:$G$28,1,FALSE)),\"fel kategori\",IF(ISNA(VLOOKUP(D36&\"_\"&E36,Viktklasser!B:D,3,FALSE)),IF(AND(D36=\"Mkn\",E36<>\"\"),D36&\" \"&E36,\"fel vikt\"),VLOOKUP(D36&\"_\"&E36,Viktklasser!B:D,3,FALSE))))","v":""}]
[1036,null,"",null,null,{"$f":"IF(B37=\"\",\"\",IF(ISNA(VLOOKUP(D37,Viktklasser!$G$1:$G$28,1,FALSE)),\"fel kategori\",IF(ISNA(VLOOKUP(D37&\"_\"&E37,Viktklasser!B:D,3,FALSE)),IF(AND(D37=\"Mkn\",E37<>\"\"),D37&\" \"&E37,\"fel vikt\"),VLOOKUP(D37&\"_\"&E37,Viktklasser!B:D,3,FALSE))))","v":""}]
[1037,null,"",null,null,{"$f":"IF(B38=\"\",\"\",IF(ISNA(VLOOKUP(D38,Viktklasser!$G$1:$G$28,1,FALSE)),\"fel kategori\",IF(ISNA(VLOOKUP(D38&\"_\"&E38,Viktklasser!B:D,3,FALSE)),IF(AND(D38=\"Mkn\",E38<>\"\"),D38&\" \"&E38,\"fel vikt\"),VLOOKUP(D38&\"_\"&E38,Viktklasser!B:D,3,FALSE))))","v":""}]
[1038,null,"",null,null,{"$f":"IF(B39=\"\",\"\",IF(ISNA(VLOOKUP(D39,Viktklasser!$G$1:$G$28,1,FALSE)),\"fel kategori\",IF(ISNA(VLOOKUP(D39&\"_\"&E39,Viktklasser!B:D,3,FALSE)),IF(AND(D39=\"Mkn\",E39<>\"\"),D39&\" \"&E39,\"fel vikt\"),VLOOKUP(D39&\"_\"&E39,Viktklasser!B:D,3,FALSE))))","v":""}]
[1039,null,"",null,null,{"$f":"IF(B40=\"\",\"\",IF(ISNA(VLOOKUP(D40,Viktklasser!$G$1:$G$28,1,FALSE)),\"fel kategori\",IF(ISNA(VLOOKUP(D40&\"_\"&E40,Viktklasser!B:D,3,FALSE)),IF(AND(D40=\"Mkn\",E40<>\"\"),D40&\" \"&E40,\"fel vikt\"),VLOOKUP(D40&\"_\"&E40,Viktklasser!B:D,3,FALSE))))","v":""}]
[1040,null,"",null,null,{"$f":"IF(B41=\"\",\"\",IF(ISNA(VLOOKUP(D41,Viktklasser!$G$1:$G$28,1,FALSE)),\"fel kategori\",IF(ISNA(VLOOKUP(D41&\"_\"&E41,Viktklasser!B:D,3,FALSE)),IF(AND(D41=\"Mkn\",E41<>\"\"),D41&\" \"&E41,\"fel vikt\"),VLOOKUP(D41&\"_\"&E41,Viktklasser!B:D,3,FALSE))))","v":""}]
[1041,null,"",null,null,{"$f":"IF(B42=\"\",\"\",IF(ISNA(VLOOKUP(D42,Viktklasser!$G$1:$G$28,1,FALSE)),\"fel kategori\",IF(ISNA(VLOOKUP(D42&\"_\"&E42,Viktklasser!B:D,3,FALSE)),IF(AND(D42=\"Mkn\",E42<>\"\"),D42&\" \"&E42,\"fel vikt\"),VLOOKUP(D42&\"_\"&E42,Viktklasser!B:D,3,FALSE))))","v":""}]
[1042,null,"",null,null,{"$f":"IF(B43=\"\",\"\",IF(ISNA(VLOOKUP(D43,Viktklasser!$G$1:$G$28,1,FALSE)),\"fel kategori\",IF(ISNA(VLOOKUP(D43&\"_\"&E43,Viktklasser!B:D,3,FALSE)),IF(AND(D43=\"Mkn\",E43<>\"\"),D43&\" \"&E43,\"fel vikt\"),VLOOKUP(D43&\"_\"&E43,Viktklasser!B:D,3,FALSE))))","v":""}]
[1043,null,"",null,null,{"$f":"IF(B44=\"\",\"\",IF(ISNA(VLOOKUP(D44,Viktklasser!$G$1:$G$28,1,FALSE)),\"fel kategori\",IF(ISNA(VLOOKUP(D44&\"_\"&E44,Viktklasser!B:D,3,FALSE)),IF(AND(D44=\"Mkn\",E44<>\"\"),D44&\" \"&E44,\"fel vikt\"),VLOOKUP(D44&\"_\"&E44,Viktklasser!B:D,3,FALSE))))","v":""}]
[1044,null,"",null,null,{"$f":"IF(B45=\"\",\"\",IF(ISNA(VLOOKUP(D45,Viktklasser!$G$1:$G$28,1,FALSE)),\"fel kategori\",IF(ISNA(VLOOKUP(D45&\"_\"&E45,Viktklasser!B:D,3,FALSE)),IF(AND(D45=\"Mkn\",E45<>\"\"),D45&\" \"&E45,\"fel vikt\"),VLOOKUP(D45&\"_\"&E45,Viktklasser!B:D,3,FALSE))))","v":""}]
[1045,null,"",null,null,{"$f":"IF(B46=\"\",\"\",IF(ISNA(VLOOKUP(D46,Viktklasser!$G$1:$G$28,1,FALSE)),\"fel kategori\",IF(ISNA(VLOOKUP(D46&\"_\"&E46,Viktklasser!B:D,3,FALSE)),IF(AND(D46=\"Mkn\",E46<>\"\"),D46&\" \"&E46,\"fel vikt\"),VLOOKUP(D46&\"_\"&E46,Viktklasser!B:D,3,FALSE))))","v":""}]
[1046,null,"",null,null,{"$f":"IF(B47=\"\",\"\",IF(ISNA(VLOOKUP(D47,Viktklasser!$G$1:$G$28,1,FALSE)),\"fel kategori\",IF(ISNA(VLOOKUP(D47&\"_\"&E47,Viktklasser!B:D,3,FALSE)),IF(AND(D47=\"Mkn\",E47<>\"\"),D47&\" \"&E47,\"fel vikt\"),VLOOKUP(D47&\"_\"&E47,Viktklasser!B:D,3,FALSE))))","v":""}]
[1047,null,"",null,null,{"$f":"IF(B48=\"\",\"\",IF(ISNA(VLOOKUP(D48,Viktklasser!$G$1:$G$28,1,FALSE)),\"fel kategori\",IF(ISNA(VLOOKUP(D48&\"_\"&E48,Viktklasser!B:D,3,FALSE)),IF(AND(D48=\"Mkn\",E48<>\"\"),D48&\" \"&E48,\"fel vikt\"),VLOOKUP(D48&\"_\"&E48,Viktklasser!B:D,3,FALSE))))","v":""}]
[1048,null,"",null,null,{"$f":"IF(B49=\"\",\"\",IF(ISNA(VLOOKUP(D49,Viktklasser!$G$1:$G$28,1,FALSE)),\"fel kategori\",IF(ISNA(VLOOKUP(D49&\"_\"&E49,Viktklasser!B:D,3,FALSE)),IF(AND(D49=\"Mkn\",E49<>\"\"),D49&\" \"&E49,\"fel vikt\"),VLOOKUP(D49&\"_\"&E49,Viktklasser!B:D,3,FALSE))))","v":""}]
[1049,null,"",null,null,{"$f":"IF(B50=\"\",\"\",IF(ISNA(VLOOKUP(D50,Viktklasser!$G$1:$G$28,1,FALSE)),\"fel kategori\",IF(ISNA(VLOOKUP(D50&\"_\"&E50,Viktklasser!B:D,3,FALSE)),IF(AND(D50=\"Mkn\",E50<>\"\"),D50&\" \"&E50,\"fel vikt\"),VLOOKUP(D50&\"_\"&E50,Viktklasser!B:D,3,FALSE))))","v":""}]
[1050,null,"",null,null,{"$f":"IF(B51=\"\",\"\",IF(ISNA(VLOOKUP(D51,Viktklasser!$G$1:$G$28,1,FALSE)),\"fel kategori\",IF(ISNA(VLOOKUP(D51&\"_\"&E51,Viktklasser!B:D,3,FALSE)),IF(AND(D51=\"Mkn\",E51<>\"\"),D51&\" \"&E51,\"fel vikt\"),VLOOKUP(D51&\"_\"&E51,Viktklasser!B:D,3,FALSE))))","v":""}]
[1051,null,"",null,null,{"$f":"IF(B52=\"\",\"\",IF(ISNA(VLOOKUP(D52,Viktklasser!$G$1:$G$28,1,FALSE)),\"fel kategori\",IF(ISNA(VLOOKUP(D52&\"_\"&E52,Viktklasser!B:D,3,FALSE)),IF(AND(D52=\"Mkn\",E52<>\"\"),D52&\" \"&E52,\"fel vikt\"),VLOOKUP(D52&\"_\"&E52,Viktklasser!B:D,3,FALSE))))","v":""}]
[1052,null,"",null,null,{"$f":"IF(B53=\"\",\"\",IF(ISNA(VLOOKUP(D53,Viktklasser!$G$1:$G$28,1,FALSE)),\"fel kategori\",IF(ISNA(VLOOKUP(D53&\"_\"&E53,Viktklasser!B:D,3,FALSE)),IF(AND(D53=\"Mkn\",E53<>\"\"),D53&\" \"&E53,\"fel vikt\"),VLOOKUP(D53&\"_\"&E53,Viktklasser!B:D,3,FALSE))))","v":""}]
[1053,null,"",null,null,{"$f":"IF(B54=\"\",\"\",IF(ISNA(VLOOKUP(D54,Viktklasser!$G$1:$G$28,1,FALSE)),\"fel kategori\",IF(ISNA(VLOOKUP(D54&\"_\"&E54,Viktklasser!B:D,3,FALSE)),IF(AND(D54=\"Mkn\",E54<>\"\"),D54&\" \"&E54,\"fel vikt\"),VLOOKUP(D54&\"_\"&E54,Viktklasser!B:D,3,FALSE))))","v":""}]
[1054,null,"",null,null,{"$f":"IF(B55=\"\",\"\",IF(ISNA(VLOOKUP(D55,Viktklasser!$G$1:$G$28,1,FALSE)),\"fel kategori\",IF(ISNA(VLOOKUP(D55&\"_\"&E55,Viktklasser!B:D,3,FALSE)),IF(AND(D55=\"Mkn\",E55<>\"\"),D55&\" \"&E55,\"fel vikt\"),VLOOKUP(D55&\"_\"&E55,Viktklasser!B:D,3,FALSE))))","v":""}]
[1055,null,"",null,null,{"$f":"IF(B56=\"\",\"\",IF(ISNA(VLOOKUP(D56,Viktklasser!$G$1:$G$28,1,FALSE)),\"fel kategori\",IF(ISNA(VLOOKUP(D56&\"_\"&E56,Viktklasser!B:D,3,FALSE)),IF(AND(D56=\"Mkn\",E56<>\"\"),D56&\" \"&E56,\"fel vikt\"),VLOOKUP(D56&\"_\"&E56,Viktklasser!B:D,3,FALSE))))","v":""}]
[1056,null,"",null,null,{"$f":"IF(B57=\"\",\"\",IF(ISNA(VLOOKUP(D57,Viktklasser!$G$1:$G$28,1,FALSE)),\"fel kategori\",IF(ISNA(VLOOKUP(D57&\"_\"&E57,Viktklasser!B:D,3,FALSE)),IF(AND(D57=\"Mkn\",E57<>\"\"),D57&\" \"&E57,\"fel vikt\"),VLOOKUP(D57&\"_\"&E57,Viktklasser!B:D,3,FALSE))))","v":""}]
[1057,null,"",null,null,{"$f":"IF(B58=\"\",\"\",IF(ISNA(VLOOKUP(D58,Viktklasser!$G$1:$G$28,1,FALSE)),\"fel kategori\",IF(ISNA(VLOOKUP(D58&\"_\"&E58,Viktklasser!B:D,3,FALSE)),IF(AND(D58=\"Mkn\",E58<>\"\"),D58&\" \"&E58,\"fel vikt\"),VLOOKUP(D58&\"_\"&E58,Viktklasser!B:D,3,FALSE))))","v":""}]
[1058,null,"",null,null,{"$f":"IF(B59=\"\",\"\",IF(ISNA(VLOOKUP(D59,Viktklasser!$G$1:$G$28,1,FALSE)),\"fel kategori\",IF(ISNA(VLOOKUP(D59&\"_\"&E59,Viktklasser!B:D,3,FALSE)),IF(AND(D59=\"Mkn\",E59<>\"\"),D59&\" \"&E59,\"fel vikt\"),VLOOKUP(D59&\"_\"&E59,Viktklasser!B:D,3,FALSE))))","v":""}]
[1059,null,"",null,null,{"$f":"IF(B60=\"\",\"\",IF(ISNA(VLOOKUP(D60,Viktklasser!$G$1:$G$28,1,FALSE)),\"fel kategori\",IF(ISNA(VLOOKUP(D60&\"_\"&E60,Viktklasser!B:D,3,FALSE)),IF(AND(D60=\"Mkn\",E60<>\"\"),D60&\" \"&E60,\"fel vikt\"),VLOOKUP(D60&\"_\"&E60,Viktklasser!B:D,3,FALSE))))","v":""}]
{"$rows_left_out":442}
{"sheet":"Viktklasser","index":1,"n_rows":373,"n_cols":16,"rows_kept":373,"cut":false,"hidden":false,"merged":[]}
[null,null,null,null,1008.9,null,"Mkn"]
["WW9 24 kg","WW9_24","WW9","WW9 24 kg",1024,"WW9_24","WW9","WW9",10,null,"SNK","NVK",null,"BIG"]
["WW9 26 kg","WW9_26","WW9","WW9 26 kg",1026,"WW9_26","WW11","WW11",10]
["WW9 29 kg","WW9_29","WW9","WW9 29 kg",1029,"WW9_29","WW14","WW14",10,null,"Mkn",null,null,null,null,1]
["WW9 32 kg","WW9_32","WW9","WW9 32 kg",1032,"WW9_32","WW17","WW17",10,null,"Tj1-Tj10",null,null,null,null,10]
["WW9 35 kg","WW9_35","WW9","WW9 35 kg",1035,"WW9_35","WW20","WW20",10,null,"K1-K20",null,null,null,null,20]
["WW9 38 kg","WW9_38","WW9","WW9 38 kg",1038,"WW9_38","WW23","WW23",10,null,"P1-P10",null,null,null,null,10]
["WW9 42 kg","WW9_42","WW9","WW9 42 kg",1042,"WW9_42","WW","WW",10,null,null,null,null,null,null,10]
["WW9 47 kg","WW9_47","WW9","WW9 47 kg",1047,"WW9_47","WW_OS","WW_OS",6,null,null,null,null,null,null,10]
["WW9 53 kg","WW9_53","WW9","WW9 53 kg",1053,"WW9_53","GR9","GR9",10,null,null,"F1-F25",null,null,null,25]
["WW9 59 kg","WW9_59","WW9","WW9 59 kg",1059,"WW9_59","GR11","GR11",10,null,null,"P1-25",null,null,null,25]
["WW11 24 kg","WW11_24","WW11","WW11 24 kg",1124,"WW11_24","GR14","GR14",11]
["WW11 26 kg","WW11_26","WW11","WW11 26 kg",1126,"WW11_26","GR17","GR17",10]
["WW11 29 kg","WW11_29","WW11","WW11 29 kg",1129,"WW11_29","GR20","GR20",10,null,null,null,null,"Ky17-Ky29"]
["WW11 32 kg","WW11_32","WW11","WW11 32 kg",1132,"WW11_32","GR23","GR23",10]
["WW11 35 kg","WW11_35","WW11","WW11 35 kg",1135,"WW11_35","GR","GR",10,null,"SNK","NVK",null,"Nat"]
["WW11 38 kg","WW11_38","WW11","WW11 38 kg",1138,"WW11_38","GR35","GR35",6,"start",99,160,null,1]
["WW11 42 kg","WW11_42","WW11","WW11 42 kg",1142,"WW11_42","FS9","FS9",10,"stopp",139,209,null,90]
["WW11 47 kg","WW11_47","WW11","WW11 47 kg",1147,"WW11_47","FS11","FS11",10]
["WW11 53 kg","WW11_53","WW11","WW11 53 kg",1153,"WW11_53","FS14","FS14",11,null,{"$f":"K18-K17+1","v":41},{"$f":"L18-L17+1","v":50},null,90]
["WW11 59 kg","WW11_59","WW11","WW11 59 kg",1159,"WW11_59","FS17","FS17",10]
["WW14 33 kg","WW14_33","WW14","WW14 33 kg",1233,"WW14_33","FS20","FS20",10]
["WW14 36 kg","WW14_36","WW14","WW14 36 kg",1236,"WW14_36","FS23","FS23",10]
["WW14 39 kg","WW14_39","WW14","WW14 39 kg",1239,"WW14_39","FS","FS",10]
["WW14 42 kg","WW14_42","WW14","WW14 42 kg",1242,"WW14_42","FS35","FS35",6]
["WW14 46 kg","WW14_46","WW14","WW14 46 kg",1246,"WW14_46","GR_OS","GR_OS",6]
["WW14 50 kg","WW14_50","WW14","WW14 50 kg",1250,"WW14_50","FS_OS","FS_OS",6]
["WW14 54 kg","WW14_54","WW14","WW14 54 kg",1254,"WW14_54","GR_Lag","GR_Lag",6]
["WW14 58 kg","WW14_58","WW14","WW14 58 kg",1258,"WW14_58"]
["WW14 62 kg","WW14_62","WW14","WW14 62 kg",1262,"WW14_62"]
["WW14 66 kg","WW14_66","WW14","WW14 66 kg",1266,"WW14_66","Tj","Tj",{"$f":"COUNTIF(C:C,H31)","v":10}]
["WW17 40 kg","WW17_40","WW17","WW17 40 kg",1340,"WW17_40","F","F",{"$f":"COUNTIF(C:C,H32)","v":25}]
["WW17 43 kg","WW17_43","WW17","WW17 43 kg",1343,"WW17_43","Ky","Ky",13]
["WW17 46 kg","WW17_46","WW17","WW17 46 kg",1346,"WW17_46"]
["WW17 49 kg","WW17_49","WW17","WW17 49 kg",1349,"WW17_49"]
["WW17 53 kg","WW17_53","WW17","WW17 53 kg",1353,"WW17_53"]
["WW17 57 kg","WW17_57","WW17","WW17 57 kg",1357,"WW17_57"]
["WW17 61 kg","WW17_61","WW17","WW17 61 kg",1361,"WW17_61"]
["WW17 65 kg","WW17_65","WW17","WW17 65 kg",1365,"WW17_65"]
["WW17 69 kg","WW17_69","WW17","WW17 69 kg",1369,"WW17_69"]
["WW17 73 kg","WW17_73","WW17","WW17 73 kg",1373,"WW17_73"]
["WW20 50 kg","WW20_50","WW20","WW20 50 kg",1450,"WW20_50"]
["WW20 53 kg","WW20_53","WW20","WW20 53 kg",1453,"WW20_53"]
["WW20 55 kg","WW20_55","WW20","WW20 55 kg",1455,"WW20_55"]
["WW20 57 kg","WW20_57","WW20","WW20 57 kg",1457,"WW20_57"]
["WW20 59 kg","WW20_59","WW20","WW20 59 kg",1459,"WW20_59"]
["WW20 62 kg","WW20_62","WW20","WW20 62 kg",1462,"WW20_62"]
["WW20 65 kg","WW20_65","WW20","WW20 65 kg",1465,"WW20_65"]
["WW20 68 kg","WW20_68","WW20","WW20 68 kg",1468,"WW20_68"]
["WW20 72 kg","WW20_72","WW20","WW20 72 kg",1472,"WW20_72"]
["WW20 76 kg","WW20_76","WW20","WW20 76 kg",1476,"WW20_76"]
["WW23 50 kg","WW23_50","WW23","WW23 50 kg",1550,"WW23_50"]
["WW23 53 kg","WW23_53","WW23","WW23 53 kg",1553,"WW23_53"]
["WW23 55 kg","WW23_55","WW23","WW23 55 kg",1555,"WW23_55"]
["WW23 57 kg","WW23_57","WW23","WW23 57 kg",1557,"WW23_57"]
["WW23 59 kg","WW23_59","WW23","WW23 59 kg",1559,"WW23_59"]
["WW23 62 kg","WW23_62","WW23","WW23 62 kg",1562,"WW23_62"]
["WW23 65 kg","WW23_65","WW23","WW23 65 kg",1565,"WW23_65"]
["WW23 68 kg","WW23_68","WW23","WW23 68 kg",1568,"WW23_68"]
["WW23 72 kg","WW23_72","WW23","WW23 72 kg",1572,"WW23_72"]
{"$rows_left_out":313}